BDBM50073610 1-[3-((R)-5-Methoxy-1,2,3,4-tetrahydro-naphthalen-1-yl)-propyl]-4-phenyl-piperazine::CHEMBL147963
SMILES COc1cccc2[C@@H](CCCN3CCN(CC3)c3ccccc3)CCCc12
InChI Key InChIKey=JGCUFOXBUYJGBX-HXUWFJFHSA-N
Data  2 IC50
  Tab Delimited (TSV)   2D SDfile   Computed 3D by Vconf -m prep SDfile
Find this compound or compounds like it in BindingDB:
Activity Spreadsheet -- Enzyme Inhibition Constant Data from BindingDB
Found 1 hit for monomerid = 50073610
Target5-hydroxytryptamine receptor 1A(Rattus norvegicus (rat))
Università
Curated by ChEMBL
LigandPNGBDBM50073610(1-[3-((R)-5-Methoxy-1,2,3,4-tetrahydro-naphthalen-...)
Affinity DataIC50:  4.30nM. Assay description: In vitro inhibition of [3H]-8-OH-DPAT binding to rat 5-HT 1a receptors.
In DepthDetails ArticlePubMed